Reaction Details
TargetReceptor-interacting serine/threonine-protein kinase 1
LigandBDBM50244731
Substrate/Competitorn/a
Meas. Tech.ChEMBL_1673964 (CHEMBL4023993)
Ki 3.0±n/a nM
Citation Yoshikawa, MSaitoh, MKatoh, TSeki, TBigi, SVShimizu, YIshii, TOkai, TKuno, MHattori, HWatanabe, ESaikatendu, KSZou, HNakakariya, MTatamiya, TNakada, YYogo, T Discovery of 7-Oxo-2,4,5,7-tetrahydro-6 H-pyrazolo[3,4- c]pyridine Derivatives as Potent, Orally Available, and Brain-Penetrating Receptor Interacting Protein 1 (RIP1) Kinase Inhibitors: Analysis of Structure-Kinetic Relationships. J Med Chem61:2384-2409 (2018) 
 
Receptor-interacting serine/threonine-protein kinase 1
Name:Receptor-interacting serine/threonine-protein kinase 1
Type:Enzyme Catalytic Domain
Mol. Mass.:75926.99
Organism:Homo sapiens (Human)
Description:Q13546
Residue:671
BDBM50244731
NameBDBM50244731
Synonyms:CHEMBL4085728
TypeSmall organic molecule
Emp. Form.C24H20FN5O3
Mol. Mass.445.4457
SMILESCN1c2ccc(cc2OC[C@H](N2CCc3cn(Cc4ccccc4F)nc3C2=O)C1=O)C#N