Reaction Details
TargetReceptor-interacting serine/threonine-protein kinase 1
LigandBDBM15003
Substrate/Competitorn/a
Meas. Tech.ChEMBL_1673964 (CHEMBL4023993)
Ki 2.0±n/a nM
Citation Yoshikawa, MSaitoh, MKatoh, TSeki, TBigi, SVShimizu, YIshii, TOkai, TKuno, MHattori, HWatanabe, ESaikatendu, KSZou, HNakakariya, MTatamiya, TNakada, YYogo, T Discovery of 7-Oxo-2,4,5,7-tetrahydro-6 H-pyrazolo[3,4- c]pyridine Derivatives as Potent, Orally Available, and Brain-Penetrating Receptor Interacting Protein 1 (RIP1) Kinase Inhibitors: Analysis of Structure-Kinetic Relationships. J Med Chem61:2384-2409 (2018) 
 
Receptor-interacting serine/threonine-protein kinase 1
Name:Receptor-interacting serine/threonine-protein kinase 1
Type:Enzyme Catalytic Domain
Mol. Mass.:75926.99
Organism:Homo sapiens (Human)
Description:Q13546
Residue:671
BDBM15003
NameBDBM15003
Synonyms:3-(4-{4-aminofuro[2,3-d]pyrimidin-5-yl}phenyl)-1-[2-fluoro-5-(trifluoromethyl)phenyl]urea D3RKN_27
TypeSmall organic molecule
Emp. Form.C20H13F4N5O2
Mol. Mass.431.3431
SMILESNc1ncnc2occ(-c3ccc(NC(=O)Nc4cc(ccc4F)C(F)(F)F)cc3)c12