Reaction Details
TargetCyclin-dependent kinase 4/G1/S-specific cyclin-D3
LigandBDBM50244875
Substrate/Competitorn/a
Meas. Tech.ChEMBL_1674279 (CHEMBL4024308)
IC50 11±n/a nM
Citation Li, YLuo, XGuo, QNie, YWang, TZhang, CHuang, ZWang, XLiu, YChen, YZheng, JYang, SFan, YXiang, R Discovery of N1-(4-((7-Cyclopentyl-6-(dimethylcarbamoyl)-7 H-pyrrolo[2,3- d]pyrimidin-2-yl)amino)phenyl)- N8-hydroxyoctanediamide as a Novel Inhibitor Targeting Cyclin-dependent Kinase 4/9 (CDK4/9) and Histone Deacetlyase1 (HDAC1) against Malignant Cancer. J Med Chem61:3166-3192 (2018) 
 
Cyclin-dependent kinase 4/G1/S-specific cyclin-D3
Name:Cyclin-dependent kinase 4/G1/S-specific cyclin-D3
Synonyms:CDK4/Cyclin D3
Type:n/a
Mol. Mass.:n/a
Description:ASSAY_ID of ChEMBL is 1806445
Components:This complex has 2 components.
Component 1
Name:Cyclin-dependent kinase 4
Type:Enzyme Subunit
Mol. Mass.:33731.96
Organism:Homo sapiens (Human)
Description:P11802
Residue:303
Component 2
Name:G1/S-specific cyclin-D3
Synonyms:CCND3 | CCND3_HUMAN
Type:Enzyme
Mol. Mass.:32521.90
Organism:Homo sapiens (Human)
Description:P30281
Residue:292
BDBM50244875
NameBDBM50244875
Synonyms:CHEMBL4073953
TypeSmall organic molecule
Emp. Form.C26H33N7O4
Mol. Mass.507.5847
SMILESCN(C)C(=O)c1cc2cnc(Nc3ccc(cc3)C(=O)NCCCCC(=O)NO)nc2n1C1CCCC1