Reaction Details
TargetAcetylcholinesterase
LigandBDBM9405
Substrate/Competitorn/a
Meas. Tech.ChEBML_28911
IC50 170±n/a nM
Citation Sugimoto, HTsuchiya, YSugumi, HHigurashi, KKaribe, NIimura, YSasaki, AAraki, SYamanishi, YYamatsu, K Synthesis and structure-activity relationships of acetylcholinesterase inhibitors: 1-benzyl-4-(2-phthalimidoethyl)piperidine and related derivatives. J Med Chem35:4542-8 (1993) Acetylcholinesterase
Name:Acetylcholinesterase
Type:Enzyme
Mol. Mass.:68165.65
Organism:Mus musculus (mouse)
Description:n/a
Residue:614
BDBM9405
NameBDBM9405
Synonyms:CHEMBL56470 N-[2-(1-benzylpiperidin-4-yl)ethyl]-N-methylbenzamide hydrochloride | Piperidine Derivative 13
TypeSmall organic molecule
Emp. Form.C22H28N2O
Mol. Mass.336.4705
SMILESCN(CCC1CCN(Cc2ccccc2)CC1)C(=O)c1ccccc1