Reaction Details
TargetAdenosine receptor A1
LigandBDBM50421980
Substrate/Competitorn/a
Meas. Tech.ChEBML_29278
EC50 20893±n/a nM
Citation Niiya, KOlsson, RAThompson, RDSilvia, SKUeeda, M 2-(N'-alkylidenehydrazino)adenosines: potent and selective coronary vasodilators. J Med Chem35:4557-61 (1993) Adenosine receptor A1
Name:Adenosine receptor A1
Type:Enzyme Catalytic Domain
Mol. Mass.:36501.39
Organism:GUINEA PIG
Description:ADENOSINE A1 ADORA1 GUINEA PIG::P47745
Residue:326
BDBM50421980
NameBDBM50421980
Synonyms:CHEMBL2113592
TypeSmall organic molecule
Emp. Form.C15H23N7O4
Mol. Mass.365.3876
SMILESCC(C)CCN=Nc1nc(N)c2ncn([C@@H]3O[C@H](CO)[C@@H](O)[C@H]3O)c2n1