Reaction Details
TargetProtein-glutamine gamma-glutamyltransferase 2
LigandBDBM50444513
Substrate/Competitorn/a
Meas. Tech.ChEMBL_1674735 (CHEMBL4024878)
IC50 30±n/a nM
Citation Song, MHwang, HIm, CYKim, SY Recent Progress in the Development of Transglutaminase 2 (TGase2) Inhibitors. J Med Chem60:554-567 (2017) 
 
Protein-glutamine gamma-glutamyltransferase 2
Name:Protein-glutamine gamma-glutamyltransferase 2
Type:Protein
Mol. Mass.:77309.30
Organism:Homo sapiens (Human)
Description:P21980
Residue:687
BDBM50444513
NameBDBM50444513
Synonyms:CHEMBL3092841
TypeSmall organic molecule
Emp. Form.C34H50N4O9
Mol. Mass.658.7822
SMILESCCOC(=O)\C=C\CC[C@H](NC(=O)OCc1ccccc1)C(=O)N[C@@H](C(C)C)C(=O)N1CCC[C@H]1C(=O)N[C@@H](CC(C)C)C(=O)OC