Reaction Details
TargetG-protein coupled receptor 84
LigandBDBM50245491
Substrate/Competitorn/a
Meas. Tech.ChEMBL_1674753 (CHEMBL4024896)
IC50 10.0±n/a nM
Citation Liu, YMNepali, KLiou, JP Idiopathic Pulmonary Fibrosis: Current Status, Recent Progress, and Emerging Targets. J Med Chem60:527-553 (2017) 
 
G-protein coupled receptor 84
Name:G-protein coupled receptor 84
Type:PROTEIN
Mol. Mass.:43726.73
Organism:Homo sapiens (Human)
Description:ChEMBL_116040
Residue:396
BDBM50245491
NameBDBM50245491
Synonyms:CHEMBL4098028
TypeSmall organic molecule
Emp. Form.C25H22N4O6
Mol. Mass.474.4654
SMILESCc1noc(COc2ccc-3c(CCn4c-3cc(OCC3COc5ncccc5O3)cc4=O)c2)n1