Reaction Details
TargetCathepsin B
LigandBDBM50245493
Substrate/Competitorn/a
Meas. Tech.ChEMBL_1674759 (CHEMBL4024902)
IC50 27±n/a nM
Citation Liu, YMNepali, KLiou, JP Idiopathic Pulmonary Fibrosis: Current Status, Recent Progress, and Emerging Targets. J Med Chem60:527-553 (2017) 
 
Cathepsin B
Name:Cathepsin B
Type:Enzyme
Mol. Mass.:37819.69
Organism:Homo sapiens (Human)
Description:gi_63102437
Residue:339
BDBM50245493
NameBDBM50245493
Synonyms:CHEMBL4092255
TypeSmall organic molecule
Emp. Form.C36H52N6O6
Mol. Mass.664.8347
SMILESCOc1ccc2c(O[C@@H]3C[C@@H](N(C[C@@H](NC(=O)NC(C)(C)C)C(C)(C)C)C3)C(=O)N[C@@H](CC3CC3)C(=O)C(=O)NC3CC3)nccc2c1