Reaction Details
TargetPotassium voltage-gated channel subfamily H member 2
LigandBDBM50245571
Substrate/Competitorn/a
Meas. Tech.ChEMBL_1674781 (CHEMBL4024924)
IC50>80000±n/a nM
Citation Marcoux, DQin, LYRuan, ZShi, QRuan, QWeigelt, CQiu, HSchieven, GHynes, JBhide, RPoss, MTino, J Identification of highly potent and selective PI3K? inhibitors. Bioorg Med Chem Lett27:2849-2853 (2017) 
 
Potassium voltage-gated channel subfamily H member 2
Name:Potassium voltage-gated channel subfamily H member 2
Type:Multi-pass membrane protein
Mol. Mass.:126672.65
Organism:Homo sapiens (Human)
Description:Q12809
Residue:1159
BDBM50245571
NameBDBM50245571
Synonyms:CHEMBL4091875
TypeSmall organic molecule
Emp. Form.C22H21F3N6O2
Mol. Mass.458.4363
SMILESC[C@H]1OC(C)(C)C(=O)N([C@H]1C)c1cc(ccc1C#N)-c1cc(c2c(N)ncnn12)C(F)(F)F