Reaction Details
TargetCytoplasmic tyrosine-protein kinase BMX
LigandBDBM50020471
Substrate/Competitorn/a
Meas. Tech.ChEMBL_1674789 (CHEMBL4024932)
IC50 24±n/a nM
Citation Liang, QChen, YYu, KChen, CZhang, SWang, AWang, WWu, HLiu, XWang, BWang, LHu, ZWang, WRen, TZhang, SLiu, QYun, CHLiu, J Discovery of N-(3-(5-((3-acrylamido-4-(morpholine-4-carbonyl)phenyl)amino)-1-methyl-6-oxo-1,6-dihydropyridin-3-yl)-2-methylphenyl)-4-(tert-butyl)benzamide (CHMFL-BTK-01) as a highly selective irreversible Bruton's tyrosine kinase (BTK) inhibitor. Eur J Med Chem131:107-125 (2017) 
 
Cytoplasmic tyrosine-protein kinase BMX
Name:Cytoplasmic tyrosine-protein kinase BMX
Type:Tyrosine-protein kinase
Mol. Mass.:78030.42
Organism:Homo sapiens (Human)
Description:P51813
Residue:675
BDBM50020471
NameBDBM50020471
Synonyms:CHEMBL3290142
TypeSmall organic molecule
Emp. Form.C29H23F3N6O3
Mol. Mass.560.5265
SMILESCc1ccc(NC(=O)c2cccc(c2)C(F)(F)F)cc1C(=O)Nc1cnc(Nc2cccc(NC(=O)C=C)c2)nc1