Reaction Details
TargetTyrosine-protein kinase BTK
LigandBDBM50245635
Substrate/Competitorn/a
Meas. Tech.ChEMBL_1674788 (CHEMBL4024931)
IC50 21±n/a nM
Citation Liang, QChen, YYu, KChen, CZhang, SWang, AWang, WWu, HLiu, XWang, BWang, LHu, ZWang, WRen, TZhang, SLiu, QYun, CHLiu, J Discovery of N-(3-(5-((3-acrylamido-4-(morpholine-4-carbonyl)phenyl)amino)-1-methyl-6-oxo-1,6-dihydropyridin-3-yl)-2-methylphenyl)-4-(tert-butyl)benzamide (CHMFL-BTK-01) as a highly selective irreversible Bruton's tyrosine kinase (BTK) inhibitor. Eur J Med Chem131:107-125 (2017) 
 
Tyrosine-protein kinase BTK
Name:Tyrosine-protein kinase BTK
Type:Enzyme
Mol. Mass.:76289.95
Organism:Homo sapiens (Human)
Description:Q06187
Residue:659
BDBM50245635
NameBDBM50245635
Synonyms:CHEMBL4076543
TypeSmall organic molecule
Emp. Form.C35H38N4O4
Mol. Mass.578.7006
SMILESCc1c(NC(=O)c2ccc(cc2)C(C)(C)C)cccc1-c1cc(Nc2ccc(cc2)C(=O)N2CCOCC2)c(=O)n(C)c1