Reaction Details
TargetEpidermal growth factor receptor
LigandBDBM50161162
Substrate/Competitorn/a
Meas. Tech.ChEMBL_1674791 (CHEMBL4024934)
IC50 442±n/a nM
Citation Liang, QChen, YYu, KChen, CZhang, SWang, AWang, WWu, HLiu, XWang, BWang, LHu, ZWang, WRen, TZhang, SLiu, QYun, CHLiu, J Discovery of N-(3-(5-((3-acrylamido-4-(morpholine-4-carbonyl)phenyl)amino)-1-methyl-6-oxo-1,6-dihydropyridin-3-yl)-2-methylphenyl)-4-(tert-butyl)benzamide (CHMFL-BTK-01) as a highly selective irreversible Bruton's tyrosine kinase (BTK) inhibitor. Eur J Med Chem131:107-125 (2017) 
 
Epidermal growth factor receptor
Name:Epidermal growth factor receptor
Type:Receptor Kinase Domain
Mol. Mass.:134279.59
Organism:Homo sapiens (Human)
Description:P00533
Residue:1210
BDBM50161162
NameBDBM50161162
Synonyms:AVL-292 Spebrutinib US10828300, Compound I-182 US9987276, Compound I-182
TypeSmall organic molecule
Emp. Form.C22H22FN5O3
Mol. Mass.423.4402
SMILESCOCCOc1ccc(Nc2ncc(F)c(Nc3cccc(NC(=O)C=C)c3)n2)cc1