Reaction Details
TargetAlpha-1A adrenergic receptor
LigandBDBM50090031
Substrate/Competitorn/a
Meas. Tech.ChEMBL_1675493 (CHEMBL4025636)
Ki 0.170000±n/a nM
Citation Kaur, RChaudhary, SKumar, KGupta, MKRawal, RK Recent synthetic and medicinal perspectives of dihydropyrimidinones: A review. Eur J Med Chem132:108-134 (2017) 
 
Alpha-1A adrenergic receptor
Name:Alpha-1A adrenergic receptor
Type:Cell-surface receptors
Mol. Mass.:51511.67
Organism:Homo sapiens (Human)
Description:P35348
Residue:466
BDBM50090031
NameBDBM50090031
Synonyms:4-(3,4-Difluoro-phenyl)-2-oxo-1,2,3,4-tetrahydro-pyrimidine-5-carboxylic acid {3-[4-(4-fluoro-phenyl)-piperidin-1-yl]-propyl}-amide | CHEMBL94167
TypeSmall organic molecule
Emp. Form.C25H27F3N4O2
Mol. Mass.472.5027
SMILESFc1ccc(cc1)C1CCN(CCCNC(=O)C2C=NC(=O)N[C@@H]2c2ccc(F)c(F)c2)CC1