Reaction Details
TargetEpidermal growth factor receptor
LigandBDBM50245700
Substrate/Competitorn/a
Meas. Tech.ChEMBL_1675765 (CHEMBL4025908)
IC50 420±n/a nM
Citation Patel, HMPawara, RAnsari, ANoolvi, MSurana, S Design and synthesis of quinazolinones as EGFR inhibitors to overcome EGFR resistance obstacle. Bioorg Med Chem25:2713-2723 (2017) 
 
Epidermal growth factor receptor
Name:Epidermal growth factor receptor
Type:Receptor Kinase Domain
Mol. Mass.:134279.59
Organism:Homo sapiens (Human)
Description:P00533
Residue:1210
BDBM50245700
NameBDBM50245700
Synonyms:CHEMBL4077349
TypeSmall organic molecule
Emp. Form.C21H14BrN3O2
Mol. Mass.420.259
SMILESBrc1ccc(cc1)C(=O)Nn1c(nc2ccccc2c1=O)-c1ccccc1