Reaction Details
TargetEpidermal growth factor receptor
LigandBDBM50245702
Substrate/Competitorn/a
Meas. Tech.ChEMBL_1675765 (CHEMBL4025908)
IC50 1680±n/a nM
Citation Patel, HMPawara, RAnsari, ANoolvi, MSurana, S Design and synthesis of quinazolinones as EGFR inhibitors to overcome EGFR resistance obstacle. Bioorg Med Chem25:2713-2723 (2017) 
 
Epidermal growth factor receptor
Name:Epidermal growth factor receptor
Type:Receptor Kinase Domain
Mol. Mass.:134279.59
Organism:Homo sapiens (Human)
Description:P00533
Residue:1210
BDBM50245702
NameBDBM50245702
Synonyms:CHEMBL4060821
TypeSmall organic molecule
Emp. Form.C22H13ClN4OS
Mol. Mass.416.883
SMILESClc1ccc2c(c1)nc(-c1ccccc1)n(-c1nnc(s1)-c1ccccc1)c2=O