Reaction Details
TargetAcetylcholinesterase
LigandBDBM10520
Substrate/Competitorn/a
Meas. Tech.ChEMBL_1675789 (CHEMBL4025932)
IC50>10000±n/a nM
Citation Li, QYang, HChen, YSun, H Recent progress in the identification of selective butyrylcholinesterase inhibitors for Alzheimer's disease. Eur J Med Chem132:294-309 (2017) 
 
Acetylcholinesterase
Name:Acetylcholinesterase
Type:Enzyme
Mol. Mass.:67659.62
Organism:Bos taurus (bovine)
Description:n/a
Residue:613
BDBM10520
NameBDBM10520
Synonyms:9-{[7-(1,2,3,4-tetrahydroacridin-9-ylsulfanyl)heptyl]sulfanyl}-1,2,3,4-tetrahydroacridine | tacrine homobivalent compound 3d
TypeSmall organic molecule
Emp. Form.C33H38N2S2
Mol. Mass.526.798
SMILESC(CCCSc1c2CCCCc2nc2ccccc12)CCCSc1c2CCCCc2nc2ccccc12