Reaction Details
TargetCholinesterase
LigandBDBM8970
Substrate/Competitorn/a
Meas. Tech.ChEMBL_1675790 (CHEMBL4025933)
IC50 35±n/a nM
Citation Li, QYang, HChen, YSun, H Recent progress in the identification of selective butyrylcholinesterase inhibitors for Alzheimer's disease. Eur J Med Chem132:294-309 (2017) 
 
Cholinesterase
Name:Cholinesterase
Type:Enzyme
Mol. Mass.:65643.35
Organism:Equus caballus (Horse)
Description:P81908
Residue:574
BDBM8970
NameBDBM8970
Synonyms:CHEMBL51197 Tacrine Dimer 4f | tacrine heterobivalent compound 3e
TypeSmall organic molecule
Emp. Form.C33H39N3S
Mol. Mass.509.748
SMILESC(CCCNc1c2CCCCc2nc2ccccc12)CCCSc1c2CCCCc2nc2ccccc12