Reaction Details
TargetCarbonic anhydrase 12
LigandBDBM50245758
Substrate/Competitorn/a
Meas. Tech.ChEBML_1675881
Ki 1.9±n/a nM
Citation Bozdag, MAlafeefy, AMAltamimi, AMCarta, FSupuran, CTVullo, D Synthesis of new 3-(2-mercapto-4-oxo-4H-quinazolin-3-yl)-benzenesulfonamides with strong inhibition properties against the tumor associated carbonic anhydrases IX and XII. Bioorg Med Chem25:2782-2788 (2017) 
 
Carbonic anhydrase 12
Name:Carbonic anhydrase 12
Type:Enzyme
Mol. Mass.:39456.00
Organism:Homo sapiens (Human)
Description:Catalytic domain of human cloned isozyme was used in the assay
Residue:354
BDBM50245758
NameBDBM50245758
Synonyms:CHEMBL4075913
TypeSmall organic molecule
Emp. Form.C14H10FN3O3S2
Mol. Mass.351.376
SMILESNS(=O)(=O)c1cccc(c1)-n1c(S)nc2cc(F)ccc2c1=O