Reaction Details
TargetHistone-arginine methyltransferase CARM1
LigandBDBM50243294
Substrate/Competitorn/a
Meas. Tech.ChEMBL_1676359 (CHEMBL4026502)
IC50 63±n/a nM
Citation Wang, CJiang, HJin, JXie, YChen, ZZhang, HLian, FLiu, YCZhang, CDing, HChen, SZhang, NZhang, YJiang, HChen, KYe, FYao, ZLuo, C Development of Potent Type I Protein Arginine Methyltransferase (PRMT) Inhibitors of Leukemia Cell Proliferation. J Med Chem60:8888-8905 (2017) 
 
Histone-arginine methyltransferase CARM1
Name:Histone-arginine methyltransferase CARM1
Type:Protein
Mol. Mass.:65855.47
Organism:Homo sapiens (Human)
Description:Q86X55
Residue:608
BDBM50243294
NameBDBM50243294
Synonyms:CHEMBL4094513
TypeSmall organic molecule
Emp. Form.C16H19ClN2S
Mol. Mass.306.853
SMILESCN(CCN)Cc1ccccc1Sc1ccccc1Cl