Reaction Details
TargetAcyl-CoA (8-3)-desaturase
LigandBDBM50246066
Substrate/Competitorn/a
Meas. Tech.ChEMBL_1676416 (CHEMBL4026559)
IC50 150±n/a nM
Citation Fujimoto, JOkamoto, RNoguchi, NHara, RMasada, SKawamoto, TNagase, HTamura, YOImanishi, MTakagahara, SKubo, KTohyama, KIida, KAndou, TMiyahisa, IMatsui, JHayashi, RMaekawa, TMatsunaga, N Discovery of 3,5-Diphenyl-4-methyl-1,3-oxazolidin-2-ones as Novel, Potent, and Orally Available?-5 Desaturase (D5D) Inhibitors. J Med Chem60:8963-8981 (2017) 
 
Acyl-CoA (8-3)-desaturase
Name:Acyl-CoA (8-3)-desaturase
Type:PROTEIN
Mol. Mass.:52505.96
Organism:Rattus norvegicus
Description:ChEMBL_852948
Residue:447
BDBM50246066
NameBDBM50246066
Synonyms:CHEMBL4085437
TypeSmall organic molecule
Emp. Form.C15H12FNO2
Mol. Mass.257.2597
SMILESFc1ccc(cc1)C1CN(C(=O)O1)c1ccccc1