Reaction Details
TargetAcyl-CoA (8-3)-desaturase
LigandBDBM50246076
Substrate/Competitorn/a
Meas. Tech.ChEMBL_1676417 (CHEMBL4026560)
IC50 1100±n/a nM
Citation Fujimoto, JOkamoto, RNoguchi, NHara, RMasada, SKawamoto, TNagase, HTamura, YOImanishi, MTakagahara, SKubo, KTohyama, KIida, KAndou, TMiyahisa, IMatsui, JHayashi, RMaekawa, TMatsunaga, N Discovery of 3,5-Diphenyl-4-methyl-1,3-oxazolidin-2-ones as Novel, Potent, and Orally Available?-5 Desaturase (D5D) Inhibitors. J Med Chem60:8963-8981 (2017) 
 
Acyl-CoA (8-3)-desaturase
Name:Acyl-CoA (8-3)-desaturase
Type:PROTEIN
Mol. Mass.:51985.80
Organism:Homo sapiens (Human)
Description:ChEMBL_1513296
Residue:444
BDBM50246076
NameBDBM50246076
Synonyms:CHEMBL4063561
TypeSmall organic molecule
Emp. Form.C16H13Cl2NO3
Mol. Mass.338.185
SMILESOc1cc(CN2CC(OC2=O)c2ccccc2)c(Cl)cc1Cl