Reaction Details
TargetProtein-arginine deiminase type-2
LigandBDBM50246179
Substrate/Competitorn/a
Meas. Tech.ChEMBL_1676559 (CHEMBL4026702)
Ki>10000000±n/a nM
Citation Tejeda, EJCBello, AMWasilewski, EKoebel, ADunn, SKotra, LP Noncovalent Protein Arginine Deiminase (PAD) Inhibitors Are Efficacious in Animal Models of Multiple Sclerosis. J Med Chem60:8876-8887 (2017) 
 
Protein-arginine deiminase type-2
Name:Protein-arginine deiminase type-2
Type:PROTEIN
Mol. Mass.:76237.59
Organism:Mus musculus
Description:ChEMBL_105600
Residue:673
BDBM50246179
NameBDBM50246179
Synonyms:CHEMBL4081389
TypeSmall organic molecule
Emp. Form.C19H20N4O3
Mol. Mass.352.3871
SMILESO=C(NCc1ccccc1)[C@H](CCn1ccnc1)NC(=O)c1ccco1