Reaction Details
TargetCarbonic anhydrase 9
LigandBDBM10880
Substrate/Competitorn/a
Meas. Tech.ChEMBL_1676581 (CHEMBL4026724)
Ki 25±n/a nM
Citation Fragai, MComito, GDi Cesare Mannelli, LGualdani, RCalderone, VLouka, ARichichi, BFrancesconi, OAngeli, ANocentini, AGratteri, PChiarugi, PGhelardini, CTadini-Buoninsegni, FSupuran, CTNativi, C Lipoyl-Homotaurine Derivative (ADM_12) Reverts Oxaliplatin-Induced Neuropathy and Reduces Cancer Cells Malignancy by Inhibiting Carbonic Anhydrase IX (CAIX). J Med Chem60:9003-9011 (2017) 
 
Carbonic anhydrase 9
Name:Carbonic anhydrase 9
Type:Enzyme
Mol. Mass.:49669.03
Organism:Homo sapiens (Human)
Description:Catalytic domain of human cloned isozyme was used in the assay
Residue:459
BDBM10880
NameBDBM10880
Synonyms:AZA AZM acetazolamide Acetazolamide Acetazolamide (AZA) Acetazolamide, 5 Acetazolamide, AZA CHEMBL20 Sulfonamide, 1 US11278534, Example acetazolamide sulfonamide 1
TypeSmall organic molecule
Emp. Form.C4H6N4O3S2
Mol. Mass.222.245
SMILESCC(=O)Nc1nnc(s1)S(N)(=O)=O