Reaction Details
TargetLanosterol 14-alpha demethylase
LigandBDBM31768
Substrate/Competitorn/a
Meas. Tech.ChEBML_52075
IC50 119±n/a nM
Citation Rotstein, DMKertesz, DJWalker, KASwinney, DC Stereoisomers of ketoconazole: preparation and biological activity. J Med Chem35:2818-25 (1992) Lanosterol 14-alpha demethylase
Name:Lanosterol 14-alpha demethylase
Type:PROTEIN
Mol. Mass.:56717.47
Organism:Rattus norvegicus
Description:ChEMBL_52075
Residue:503
BDBM31768
NameBDBM31768
Synonyms:CHEMBL295698 Nizoral | Panfungol
TypeSmall organic molecule
Emp. Form.C26H28Cl2N4O4
Mol. Mass.531.431
SMILESCC(=O)N1CCN(CC1)c1ccc(OC[C@@H]2CO[C@](Cn3ccnc3)(O2)c2ccc(Cl)cc2Cl)cc1