Reaction Details
TargetCholesterol side-chain cleavage enzyme, mitochondrial
LigandBDBM50004442
Substrate/Competitorn/a
Meas. Tech.ChEBML_50353
IC50 2950±n/a nM
Citation Rotstein, DMKertesz, DJWalker, KASwinney, DC Stereoisomers of ketoconazole: preparation and biological activity. J Med Chem35:2818-25 (1992) Cholesterol side-chain cleavage enzyme, mitochondrial
Name:Cholesterol side-chain cleavage enzyme, mitochondrial
Type:PROTEIN
Mol. Mass.:60603.33
Organism:Rattus norvegicus
Description:ChEMBL_50353
Residue:526
BDBM50004442
NameBDBM50004442
Synonyms:(2S,4S)-ketoconazole CHEMBL319160 | CIS-1-ACETYL-4-(4-((2-(2,4-DICHLOROPHENYL)-2-(1H-IMIDAZOL-1-YLMETHYL)-1,3-DIOXOLAN-4-YL)METHOXY)PHENYL)PIPERAZINE
TypeSmall organic molecule
Emp. Form.C26H28Cl2N4O4
Mol. Mass.531.431
SMILESCC(=O)N1CCN(CC1)c1ccc(OC[C@H]2CO[C@](Cn3ccnc3)(O2)c2ccc(Cl)cc2Cl)cc1