Reaction Details
TargetCholesterol side-chain cleavage enzyme, mitochondrial
LigandBDBM50004441
Substrate/Competitorn/a
Meas. Tech.ChEBML_50353
IC50 3920±n/a nM
Citation Rotstein, DMKertesz, DJWalker, KASwinney, DC Stereoisomers of ketoconazole: preparation and biological activity. J Med Chem35:2818-25 (1992) Cholesterol side-chain cleavage enzyme, mitochondrial
Name:Cholesterol side-chain cleavage enzyme, mitochondrial
Type:PROTEIN
Mol. Mass.:60603.33
Organism:Rattus norvegicus
Description:ChEMBL_50353
Residue:526
BDBM50004441
NameBDBM50004441
Synonyms:(2R,4R)-ketoconazole CHEMBL328863
TypeSmall organic molecule
Emp. Form.C26H28Cl2N4O4
Mol. Mass.531.431
SMILESCC(=O)N1CCN(CC1)c1ccc(OC[C@@H]2CO[C@@](Cn3ccnc3)(O2)c2ccc(Cl)cc2Cl)cc1