Reaction Details
TargetDihydrofolate reductase
LigandBDBM18512
Substrate/Competitorn/a
Meas. Tech.ChEMBL_54552 (CHEMBL664868)
Ki 1.2±n/a nM
Citation Wagner, CRBenkovic, SJ Probing the molecular basis of resistance to pyrimethamine by site-directed mutagenesis. J Med Chem35:2912-5 (1992) Dihydrofolate reductase
Name:Dihydrofolate reductase
Type:n/a
Mol. Mass.:17532.46
Organism:Escherichia coli
Description:n/a
Residue:157
BDBM18512
NameBDBM18512
Synonyms:5-(4-chlorophenyl)-6-ethylpyrimidine-2,4-diamine Pyrimethamine (Pyr) cid_4993
TypeSmall organic molecule
Emp. Form.C12H13ClN4
Mol. Mass.248.711
SMILESCCc1nc(N)nc(N)c1-c1ccc(Cl)cc1