Reaction Details
TargetBifunctional dihydrofolate reductase-thymidylate synthase
LigandBDBM18512
Substrate/Competitorn/a
Meas. Tech.ChEMBL_55269 (CHEMBL663722)
Ki 0.190000±n/a nM
Citation Wagner, CRBenkovic, SJ Probing the molecular basis of resistance to pyrimethamine by site-directed mutagenesis. J Med Chem35:2912-5 (1992) Bifunctional dihydrofolate reductase-thymidylate synthase
Name:Bifunctional dihydrofolate reductase-thymidylate synthase
Type:Enzyme
Mol. Mass.:71822.51
Organism:Plasmodium falciparum (isolate K1 / Thailand)
Description:The mutant clone was prepared by cassette mutagenesis using wildtype pfDHFR as a template, and expressed in E. coli.
Residue:608
BDBM18512
NameBDBM18512
Synonyms:5-(4-chlorophenyl)-6-ethylpyrimidine-2,4-diamine Pyrimethamine (Pyr) cid_4993
TypeSmall organic molecule
Emp. Form.C12H13ClN4
Mol. Mass.248.711
SMILESCCc1nc(N)nc(N)c1-c1ccc(Cl)cc1