Reaction Details
TargetPhospholipase A2, major isoenzyme
LigandBDBM50004504
Substrate/Competitorn/a
Meas. Tech.ChEMBL_156346 (CHEMBL759989)
IC50 1400±n/a nM
Citation Bennion, CConnolly, SGensmantel, NPHallam, CJackson, CGPrimrose, WURoberts, GCRobinson, DHSlaich, PK Design and synthesis of some substrate analogue inhibitors of phospholipase A2 and investigations by NMR and molecular modeling into the binding interactions in the enzyme-inhibitor complex. J Med Chem35:2939-51 (1992) Phospholipase A2, major isoenzyme
Name:Phospholipase A2, major isoenzyme
Type:Hydrolase; monomer or homodimer
Mol. Mass.:16279.83
Organism:Sus scrofa (pig)
Description:Purchased from Sigma.
Residue:146
BDBM50004504
NameBDBM50004504
Synonyms:(R)-O-(2-Hexadecanamidopropyl] phosphocholine | CHEMBL102135
TypeSmall organic molecule
Emp. Form.C24H51N2O5P
Mol. Mass.478.6459
(=O)N[C@H](C)COP([O-])(=O)OCC[N+](C)(C)C