Reaction Details
TargetDual specificity protein kinase CLK2
LigandBDBM50246769
Substrate/Competitorn/a
Meas. Tech.ChEMBL_1676871 (CHEMBL4027014)
IC50 5.0±n/a nM
Citation Scott, JSDegorce, SLAnjum, RCulshaw, JDavies, RDMDavies, NLDillman, KSDowling, JEDrew, LFerguson, ADGroombridge, SDHalsall, CTHudson, JALamont, SLindsay, NAMarden, SKMayo, MFPease, JEPerkins, DRPink, JHRobb, GRRosen, AShen, MMcWhirter, CWu, D Discovery and Optimization of Pyrrolopyrimidine Inhibitors of Interleukin-1 Receptor Associated Kinase 4 (IRAK4) for the Treatment of Mutant MYD88 J Med Chem60:10071-10091 (2017) 
 
Dual specificity protein kinase CLK2
Name:Dual specificity protein kinase CLK2
Type:n/a
Mol. Mass.:60128.79
Organism:Homo sapiens (Human)
Description:P49760
Residue:499
BDBM50246769
NameBDBM50246769
Synonyms:CHEMBL4064608
TypeSmall organic molecule
Emp. Form.C21H31N5O2
Mol. Mass.385.5031
SMILESC1CC(CCO1)c1c[nH]c2ncnc(N[C@H]3CC[C@@H](CC3)N3CCOCC3)c12