Reaction Details
TargetInterleukin-1 receptor-associated kinase 4
LigandBDBM50246814
Substrate/Competitorn/a
Meas. Tech.ChEMBL_1676839 (CHEMBL4026982)
IC50 5.0±n/a nM
Citation Scott, JSDegorce, SLAnjum, RCulshaw, JDavies, RDMDavies, NLDillman, KSDowling, JEDrew, LFerguson, ADGroombridge, SDHalsall, CTHudson, JALamont, SLindsay, NAMarden, SKMayo, MFPease, JEPerkins, DRPink, JHRobb, GRRosen, AShen, MMcWhirter, CWu, D Discovery and Optimization of Pyrrolopyrimidine Inhibitors of Interleukin-1 Receptor Associated Kinase 4 (IRAK4) for the Treatment of Mutant MYD88 J Med Chem60:10071-10091 (2017) 
 
Interleukin-1 receptor-associated kinase 4
Name:Interleukin-1 receptor-associated kinase 4
Type:Protein
Mol. Mass.:51519.08
Organism:Homo sapiens (Human)
Description:Q9NWZ3
Residue:460
BDBM50246814
NameBDBM50246814
Synonyms:CHEMBL4085735
TypeSmall organic molecule
Emp. Form.C17H27N5
Mol. Mass.301.4298
SMILESCC(C)c1c[nH]c2ncnc(N[C@H]3CC[C@@H](CC3)N(C)C)c12