Reaction Details
TargetNeuronal acetylcholine receptor subunit alpha-4/beta-2
LigandBDBM50246827
Substrate/Competitorn/a
Meas. Tech.ChEMBL_1676968 (CHEMBL4027111)
Ki 80±n/a nM
Citation Wu, JCippitelli, AZhang, YDebevec, GSchoch, JOzawa, AYu, YLiu, HChen, WHoughten, RAWelmaker, GSGiulianotti, MAToll, L Highly Selective and Potent?4?2 nAChR Antagonist Inhibits Nicotine Self-Administration and Reinstatement in Rats. J Med Chem60:10092-10104 (2017) 
 
Neuronal acetylcholine receptor subunit alpha-4/beta-2
Name:Neuronal acetylcholine receptor subunit alpha-4/beta-2
Type:n/a
Mol. Mass.:n/a
Description:n/a
Components:This complex has 0 components.
Component 1
Name:Neuronal acetylcholine receptor subunit alpha-4
Synonyms:ACHA4_RAT Cholinergic, Nicotinic Alpha4Beta2 Chrna4 Neuronal acetylcholine receptor (alpha4beta2 nAChR) Neuronal acetylcholine receptor subunit alpha 4 beta 2 | Neuronal acetylcholine receptor subunit alpha-4
Type:Enzyme
Mol. Mass.:70196.44
Organism:Rattus norvegicus (Rat)
Description:P09483
Residue:630
Component 2
Name:Neuronal acetylcholine receptor subunit beta-2
Synonyms:ACHB2_RAT Chrnb2 Neuronal acetylcholine receptor non-alpha-1 chain
Type:Enzyme
Mol. Mass.:56910.32
Organism:Rattus norvegicus (Rat)
Description:P12390
Residue:500
BDBM50246827
NameBDBM50246827
Synonyms:CHEMBL4100236
TypeSmall organic molecule
Emp. Form.C10H13ClN4
Mol. Mass.224.69
SMILESClc1ccc(CCN2CCNC2=N)cn1