Reaction Details
TargetNeuronal acetylcholine receptor subunit alpha-3/beta-4
LigandBDBM50246834
Substrate/Competitorn/a
Meas. Tech.ChEMBL_1676966 (CHEMBL4027109)
Ki 125±n/a nM
Citation Wu, JCippitelli, AZhang, YDebevec, GSchoch, JOzawa, AYu, YLiu, HChen, WHoughten, RAWelmaker, GSGiulianotti, MAToll, L Highly Selective and Potent?4?2 nAChR Antagonist Inhibits Nicotine Self-Administration and Reinstatement in Rats. J Med Chem60:10092-10104 (2017) 
 
Neuronal acetylcholine receptor subunit alpha-3/beta-4
Name:Neuronal acetylcholine receptor subunit alpha-3/beta-4
Type:Protein
Mol. Mass.:n/a
Description:n/a
Components:This complex has 2 components.
Component 1
Name:Neuronal acetylcholine receptor subunit alpha-3
Synonyms:ACHA3_RAT Chrna3
Type:Enzyme
Mol. Mass.:56995.52
Organism:Rattus norvegicus (Rat)
Description:P04757
Residue:499
Component 2
Name:Neuronal acetylcholine receptor subunit beta-4
Synonyms:ACHB4_RAT Chrnb4 Neuronal acetylcholine receptor non-alpha-2 chain | Neuronal acetylcholine receptor protein beta-4 subunit
Type:Enzyme
Mol. Mass.:55863.89
Organism:Rattus norvegicus (Rat)
Description:P12392
Residue:495
BDBM50246834
NameBDBM50246834
Synonyms:CHEMBL4067640
TypeSmall organic molecule
Emp. Form.C11H15ClN4
Mol. Mass.238.717
SMILESC[C@H]1CNC(=N)N1CCc1ccc(Cl)nc1