Reaction Details
TargetHistone deacetylase 8
LigandBDBM50397360
Substrate/Competitorn/a
Meas. Tech.ChEMBL_1677037 (CHEMBL4027180)
IC50 92±n/a nM
Citation Heimburg, TKolbinger, FRZeyen, PGhazy, EHerp, DSchmidtkunz, KMelesina, JShaik, TBErdmann, FSchmidt, MRomier, CRobaa, DWitt, OOehme, IJung, MSippl, W Structure-Based Design and Biological Characterization of Selective Histone Deacetylase 8 (HDAC8) Inhibitors with Anti-Neuroblastoma Activity. J Med Chem60:10188-10204 (2017) 
 
Histone deacetylase 8
Name:Histone deacetylase 8
Type:Enzyme
Mol. Mass.:41749.60
Organism:Homo sapiens (Human)
Description:Q9BY41
Residue:377
BDBM50397360
NameBDBM50397360
Synonyms:CHEMBL2170177 | US10188756, Compound CN110
TypeSmall organic molecule
Emp. Form.C17H16N2O3
Mol. Mass.296.3205
SMILESCOc1ccc(Cn2ccc3ccc(cc23)C(=O)NO)cc1