Reaction Details
TargetHistone deacetylase 8
LigandBDBM50246847
Substrate/Competitorn/a
Meas. Tech.ChEMBL_1677037 (CHEMBL4027180)
IC50 35±n/a nM
Citation Heimburg, TKolbinger, FRZeyen, PGhazy, EHerp, DSchmidtkunz, KMelesina, JShaik, TBErdmann, FSchmidt, MRomier, CRobaa, DWitt, OOehme, IJung, MSippl, W Structure-Based Design and Biological Characterization of Selective Histone Deacetylase 8 (HDAC8) Inhibitors with Anti-Neuroblastoma Activity. J Med Chem60:10188-10204 (2017) 
 
Histone deacetylase 8
Name:Histone deacetylase 8
Type:Enzyme
Mol. Mass.:41749.60
Organism:Homo sapiens (Human)
Description:Q9BY41
Residue:377
BDBM50246847
NameBDBM50246847
Synonyms:CHEMBL4089635
TypeSmall organic molecule
Emp. Form.C15H14Cl2N2O2
Mol. Mass.325.19
SMILESCc1ccc(cc1NCc1ccc(Cl)cc1Cl)C(=O)NO