Reaction Details
TargetHistone deacetylase 8
LigandBDBM50246866
Substrate/Competitorn/a
Meas. Tech.ChEMBL_1677049 (CHEMBL4027192)
IC50 27±n/a nM
Citation Heimburg, TKolbinger, FRZeyen, PGhazy, EHerp, DSchmidtkunz, KMelesina, JShaik, TBErdmann, FSchmidt, MRomier, CRobaa, DWitt, OOehme, IJung, MSippl, W Structure-Based Design and Biological Characterization of Selective Histone Deacetylase 8 (HDAC8) Inhibitors with Anti-Neuroblastoma Activity. J Med Chem60:10188-10204 (2017) 
 
Histone deacetylase 8
Name:Histone deacetylase 8
Type:Enzyme
Mol. Mass.:41749.60
Organism:Homo sapiens (Human)
Description:Q9BY41
Residue:377
BDBM50246866
NameBDBM50246866
Synonyms:CHEMBL4078458 | US11505523, Compound 22d
TypeSmall organic molecule
Emp. Form.C22H19NO3
Mol. Mass.345.3912
SMILESCOc1ccc(\C=C\C(=O)NO)c(c1)-c1ccc(cc1)-c1ccccc1