Reaction Details
TargetHistone deacetylase 8
LigandBDBM50246874
Substrate/Competitorn/a
Meas. Tech.ChEMBL_1677037 (CHEMBL4027180)
IC50 38±n/a nM
Citation Heimburg, TKolbinger, FRZeyen, PGhazy, EHerp, DSchmidtkunz, KMelesina, JShaik, TBErdmann, FSchmidt, MRomier, CRobaa, DWitt, OOehme, IJung, MSippl, W Structure-Based Design and Biological Characterization of Selective Histone Deacetylase 8 (HDAC8) Inhibitors with Anti-Neuroblastoma Activity. J Med Chem60:10188-10204 (2017) 
 
Histone deacetylase 8
Name:Histone deacetylase 8
Type:Enzyme
Mol. Mass.:41749.60
Organism:Homo sapiens (Human)
Description:Q9BY41
Residue:377
BDBM50246874
NameBDBM50246874
Synonyms:CHEMBL4095643
TypeSmall organic molecule
Emp. Form.C15H13ClN2O4
Mol. Mass.320.728
SMILESCOc1ccc(cc1C(=O)Nc1ccc(Cl)cc1)C(=O)NO