Reaction Details
TargetPlatelet-activating factor acetylhydrolase
LigandBDBM50246878
Substrate/Competitorn/a
Meas. Tech.ChEMBL_1677056 (CHEMBL4027199)
IC50 14±n/a nM
Citation Liu, QHuang, FYuan, XWang, KZou, YShen, JXu, Y Structure-Guided Discovery of Novel, Potent, and Orally Bioavailable Inhibitors of Lipoprotein-Associated Phospholipase A2. J Med Chem60:10231-10244 (2017) 
 
Platelet-activating factor acetylhydrolase
Name:Platelet-activating factor acetylhydrolase
Type:PROTEIN
Mol. Mass.:50084.41
Organism:Homo sapiens (Human)
Description:ChEMBL_156212
Residue:441
BDBM50246878
NameBDBM50246878
Synonyms:CHEMBL4088985
TypeSmall organic molecule
Emp. Form.C20H13ClF3N3O3S
Mol. Mass.467.849
SMILESNc1ccc(cc1)S(=O)(=O)Nc1ccc(Oc2ccc(Cl)c(c2)C(F)(F)F)c(c1)C#N