Reaction Details
TargetPlatelet-activating factor acetylhydrolase
LigandBDBM50246882
Substrate/Competitorn/a
Meas. Tech.ChEMBL_1677056 (CHEMBL4027199)
IC50 57±n/a nM
Citation Liu, QHuang, FYuan, XWang, KZou, YShen, JXu, Y Structure-Guided Discovery of Novel, Potent, and Orally Bioavailable Inhibitors of Lipoprotein-Associated Phospholipase A2. J Med Chem60:10231-10244 (2017) 
 
Platelet-activating factor acetylhydrolase
Name:Platelet-activating factor acetylhydrolase
Type:PROTEIN
Mol. Mass.:50084.41
Organism:Homo sapiens (Human)
Description:ChEMBL_156212
Residue:441
BDBM50246882
NameBDBM50246882
Synonyms:CHEMBL4096131
TypeSmall organic molecule
Emp. Form.C24H20ClF3N4O3S
Mol. Mass.536.954
SMILESFC(F)(F)c1cc(Oc2ccc(NS(=O)(=O)c3ccc(cc3)N3CCNCC3)cc2C#N)ccc1Cl