Reaction Details
TargetPlatelet-activating factor acetylhydrolase
LigandBDBM50246898
Substrate/Competitorn/a
Meas. Tech.ChEMBL_1677056 (CHEMBL4027199)
IC50 65±n/a nM
Citation Liu, QHuang, FYuan, XWang, KZou, YShen, JXu, Y Structure-Guided Discovery of Novel, Potent, and Orally Bioavailable Inhibitors of Lipoprotein-Associated Phospholipase A2. J Med Chem60:10231-10244 (2017) 
 
Platelet-activating factor acetylhydrolase
Name:Platelet-activating factor acetylhydrolase
Type:PROTEIN
Mol. Mass.:50084.41
Organism:Homo sapiens (Human)
Description:ChEMBL_156212
Residue:441
BDBM50246898
NameBDBM50246898
Synonyms:CHEMBL4091394
TypeSmall organic molecule
Emp. Form.C20H12ClF3N2O3S
Mol. Mass.452.834
SMILESFC(F)(F)c1cc(Oc2ccc(NS(=O)(=O)c3ccccc3)cc2C#N)ccc1Cl