Reaction Details
TargetPlatelet-activating factor acetylhydrolase
LigandBDBM50246901
Substrate/Competitorn/a
Meas. Tech.ChEMBL_1677056 (CHEMBL4027199)
IC50 42±n/a nM
Citation Liu, QHuang, FYuan, XWang, KZou, YShen, JXu, Y Structure-Guided Discovery of Novel, Potent, and Orally Bioavailable Inhibitors of Lipoprotein-Associated Phospholipase A2. J Med Chem60:10231-10244 (2017) 
 
Platelet-activating factor acetylhydrolase
Name:Platelet-activating factor acetylhydrolase
Type:PROTEIN
Mol. Mass.:50084.41
Organism:Homo sapiens (Human)
Description:ChEMBL_156212
Residue:441
BDBM50246901
NameBDBM50246901
Synonyms:CHEMBL4074539
TypeSmall organic molecule
Emp. Form.C24H19ClF3N3O4S
Mol. Mass.537.939
SMILESFC(F)(F)c1cc(Oc2ccc(NS(=O)(=O)c3ccc(cc3)N3CCOCC3)cc2C#N)ccc1Cl