Reaction Details
TargetCarbonic anhydrase 2
LigandBDBM50004551
Substrate/Competitorn/a
Meas. Tech.ChEMBL_45061 (CHEMBL658057)
Ki 1.2±n/a nM
Citation Hartman, GDHalczenko, WPrugh, JDSmith, RLSugrue, MFMallorga, PMichelson, SRRandall, WCSchwam, HSondey, JM Thieno[2,3-b]furan-2-sulfonamides as topical carbonic anhydrase inhibitors. J Med Chem35:3027-33 (1992) Carbonic anhydrase 2
Name:Carbonic anhydrase 2
Type:Enzyme
Mol. Mass.:29250.71
Organism:Homo sapiens (Human)
Description:P00918
Residue:260
BDBM50004551
NameBDBM50004551
Synonyms:5-Morpholin-4-ylmethyl-thieno[2,3-b]furan-2-sulfonic acid amide | CHEMBL105080
TypeSmall organic molecule
Emp. Form.C11H14N2O4S2
Mol. Mass.302.37
SMILESNS(=O)(=O)c1cc2cc(CN3CCOCC3)sc2o1