Reaction Details
TargetCarbonic anhydrase 2
LigandBDBM50004553
Substrate/Competitorn/a
Meas. Tech.ChEMBL_45061 (CHEMBL658057)
Ki 2.6±n/a nM
Citation Hartman, GDHalczenko, WPrugh, JDSmith, RLSugrue, MFMallorga, PMichelson, SRRandall, WCSchwam, HSondey, JM Thieno[2,3-b]furan-2-sulfonamides as topical carbonic anhydrase inhibitors. J Med Chem35:3027-33 (1992) Carbonic anhydrase 2
Name:Carbonic anhydrase 2
Type:Enzyme
Mol. Mass.:29250.71
Organism:Homo sapiens (Human)
Description:P00918
Residue:260
BDBM50004553
NameBDBM50004553
Synonyms:5-{[Bis-(2-methoxy-ethyl)-amino]-methyl}-thieno[2,3-b]furan-2-sulfonic acid amide | CHEMBL103143
TypeSmall organic molecule
Emp. Form.C13H20N2O5S2
Mol. Mass.348.438
SMILESCOCCN(CCOC)Cc1cc2cc(oc2s1)S(N)(=O)=O