Reaction Details
TargetcAMP and cAMP-inhibited cGMP 3',5'-cyclic phosphodiesterase 10A
LigandBDBM50246908
Substrate/Competitorn/a
Meas. Tech.ChEMBL_1677119 (CHEMBL4027262)
IC50 4030±n/a nM
Citation Carzaniga, LAmari, GRizzi, ACapaldi, CDe Fanti, RGhidini, EVilletti, GCarnini, CMoretto, NFacchinetti, FCaruso, PMarchini, GBattipaglia, LPatacchini, RCenacchi, VVolta, RAmadei, FPappani, ACapacchi, SBagnacani, VDelcanale, MPuccini, PCatinella, SCivelli, MArmani, E Discovery and Optimization of Thiazolidinyl and Pyrrolidinyl Derivatives as Inhaled PDE4 Inhibitors for Respiratory Diseases. J Med Chem60:10026-10046 (2017) 
 
cAMP and cAMP-inhibited cGMP 3',5'-cyclic phosphodiesterase 10A
Name:cAMP and cAMP-inhibited cGMP 3',5'-cyclic phosphodiesterase 10A
Type:Protein
Mol. Mass.:88412.52
Organism:Homo sapiens (Human)
Description:Q9Y233
Residue:779
BDBM50246908
NameBDBM50246908
Synonyms:CHEMBL4093768
TypeSmall organic molecule
Emp. Form.C32H33Cl2F2N3O8S
Mol. Mass.728.588
SMILESCN(C)C(=O)c1cccc(c1)S(=O)(=O)N1CCC[C@H]1C(=O)O[C@@H](Cc1c(Cl)c[n+]([O-])cc1Cl)c1ccc(OC(F)F)c(OCC2CC2)c1