Reaction Details
TargetDual 3',5'-cyclic-AMP and -GMP phosphodiesterase 11A
LigandBDBM50246908
Substrate/Competitorn/a
Meas. Tech.ChEMBL_1677120 (CHEMBL4027263)
IC50>30000±n/a nM
Citation Carzaniga, LAmari, GRizzi, ACapaldi, CDe Fanti, RGhidini, EVilletti, GCarnini, CMoretto, NFacchinetti, FCaruso, PMarchini, GBattipaglia, LPatacchini, RCenacchi, VVolta, RAmadei, FPappani, ACapacchi, SBagnacani, VDelcanale, MPuccini, PCatinella, SCivelli, MArmani, E Discovery and Optimization of Thiazolidinyl and Pyrrolidinyl Derivatives as Inhaled PDE4 Inhibitors for Respiratory Diseases. J Med Chem60:10026-10046 (2017) 
 
Dual 3',5'-cyclic-AMP and -GMP phosphodiesterase 11A
Name:Dual 3',5'-cyclic-AMP and -GMP phosphodiesterase 11A
Type:Enzyme
Mol. Mass.:104751.53
Organism:Homo sapiens (Human)
Description:Q9HCR9
Residue:933
BDBM50246908
NameBDBM50246908
Synonyms:CHEMBL4093768
TypeSmall organic molecule
Emp. Form.C32H33Cl2F2N3O8S
Mol. Mass.728.588
SMILESCN(C)C(=O)c1cccc(c1)S(=O)(=O)N1CCC[C@H]1C(=O)O[C@@H](Cc1c(Cl)c[n+]([O-])cc1Cl)c1ccc(OC(F)F)c(OCC2CC2)c1