Reaction Details
TargetHistone-lysine N-methyltransferase EZH2
LigandBDBM50246952
Substrate/Competitorn/a
Meas. Tech.ChEMBL_1677254 (CHEMBL4027397)
IC50 41±n/a nM
Citation Kung, PPBingham, PBrooun, ACollins, MDeng, YLDinh, DFan, CGajiwala, KSGrantner, RGukasyan, HJHu, WHuang, BKania, RKephart, SEKrivacic, CKumpf, RAKhamphavong, PKraus, MLiu, WMaegley, KANguyen, LRen, SRichter, DRollins, RASach, NSharma, SSherrill, JSpangler, JStewart, AESutton, SUryu, SVerhelle, DWang, HWang, SWythes, MXin, SYamazaki, SZhu, HZhu, JZehnder, LEdwards, M Optimization of Orally Bioavailable Enhancer of Zeste Homolog 2 (EZH2) Inhibitors Using Ligand and Property-Based Design Strategies: Identification of Development Candidate (R)-5,8-Dichloro-7-(methoxy(oxetan-3-yl)methyl)-2-((4-methoxy-6-methyl-2-oxo-1,2-dihydropyridin-3-yl)methyl)-3,4-dihydroisoquin J Med Chem61:650-665 (2018) 
 
Histone-lysine N-methyltransferase EZH2
Name:Histone-lysine N-methyltransferase EZH2
Type:Protein
Mol. Mass.:85367.84
Organism:Homo sapiens (Human)
Description:Q15910
Residue:746
BDBM50246952
NameBDBM50246952
Synonyms:CHEMBL4073054 | US10570121, Example 12
TypeSmall organic molecule
Emp. Form.C23H26Cl2N2O4
Mol. Mass.465.37
SMILES[H][C@]1(CCCO1)[C@@H](CO)c1cc(Cl)c2CCN(Cc3c(C)cc(C)[nH]c3=O)C(=O)c2c1Cl