Reaction Details
TargetHistone-lysine N-methyltransferase EZH2
LigandBDBM50246964
Substrate/Competitorn/a
Meas. Tech.ChEMBL_1677254 (CHEMBL4027397)
IC50 129±n/a nM
Citation Kung, PPBingham, PBrooun, ACollins, MDeng, YLDinh, DFan, CGajiwala, KSGrantner, RGukasyan, HJHu, WHuang, BKania, RKephart, SEKrivacic, CKumpf, RAKhamphavong, PKraus, MLiu, WMaegley, KANguyen, LRen, SRichter, DRollins, RASach, NSharma, SSherrill, JSpangler, JStewart, AESutton, SUryu, SVerhelle, DWang, HWang, SWythes, MXin, SYamazaki, SZhu, HZhu, JZehnder, LEdwards, M Optimization of Orally Bioavailable Enhancer of Zeste Homolog 2 (EZH2) Inhibitors Using Ligand and Property-Based Design Strategies: Identification of Development Candidate (R)-5,8-Dichloro-7-(methoxy(oxetan-3-yl)methyl)-2-((4-methoxy-6-methyl-2-oxo-1,2-dihydropyridin-3-yl)methyl)-3,4-dihydroisoquin J Med Chem61:650-665 (2018) 
 
Histone-lysine N-methyltransferase EZH2
Name:Histone-lysine N-methyltransferase EZH2
Type:Protein
Mol. Mass.:85367.84
Organism:Homo sapiens (Human)
Description:Q15910
Residue:746
BDBM50246964
NameBDBM50246964
Synonyms:CHEMBL4060640 | US10570121, Example 18
TypeSmall organic molecule
Emp. Form.C20H22Cl2N2O3
Mol. Mass.409.306
SMILESC[C@H](CO)c1cc(Cl)c2CCN(Cc3c(C)cc(C)[nH]c3=O)C(=O)c2c1Cl