Reaction Details
TargetHistone-lysine N-methyltransferase EZH1
LigandBDBM50246967
Substrate/Competitorn/a
Meas. Tech.ChEMBL_1677282 (CHEMBL4027425)
Ki 70±n/a nM
Citation Kung, PPBingham, PBrooun, ACollins, MDeng, YLDinh, DFan, CGajiwala, KSGrantner, RGukasyan, HJHu, WHuang, BKania, RKephart, SEKrivacic, CKumpf, RAKhamphavong, PKraus, MLiu, WMaegley, KANguyen, LRen, SRichter, DRollins, RASach, NSharma, SSherrill, JSpangler, JStewart, AESutton, SUryu, SVerhelle, DWang, HWang, SWythes, MXin, SYamazaki, SZhu, HZhu, JZehnder, LEdwards, M Optimization of Orally Bioavailable Enhancer of Zeste Homolog 2 (EZH2) Inhibitors Using Ligand and Property-Based Design Strategies: Identification of Development Candidate (R)-5,8-Dichloro-7-(methoxy(oxetan-3-yl)methyl)-2-((4-methoxy-6-methyl-2-oxo-1,2-dihydropyridin-3-yl)methyl)-3,4-dihydroisoquin J Med Chem61:650-665 (2018) 
 
Histone-lysine N-methyltransferase EZH1
Name:Histone-lysine N-methyltransferase EZH1
Type:Protein
Mol. Mass.:85285.34
Organism:Homo sapiens (Human)
Description:Q92800
Residue:747
BDBM50246967
NameBDBM50246967
Synonyms:CHEMBL4080228 | US10570121, Example 81
TypeSmall organic molecule
Emp. Form.C22H24Cl2N2O5
Mol. Mass.467.342
SMILESCO[C@H](C1COC1)c1cc(Cl)c2CCN(Cc3c(OC)cc(C)[nH]c3=O)C(=O)c2c1Cl