Reaction Details
TargetCholinesterase
LigandBDBM50246977
Substrate/Competitorn/a
Meas. Tech.ChEMBL_1677307 (CHEMBL4027450)
IC50 67±n/a nM
Citation Ko?ak, UBrus, BKnez, D?akelj, STrontelj, JPi?lar, A?ink, RJuki?, M?ivin, MPodkowa, ANachon, FBrazzolotto, XStojan, JKos, JCoquelle, NSa?at, KColletier, JPGobec, S The Magic of Crystal Structure-Based Inhibitor Optimization: Development of a Butyrylcholinesterase Inhibitor with Picomolar Affinity and in Vivo Activity. J Med Chem61:119-139 (2018) 
 
Cholinesterase
Name:Cholinesterase
Type:Homotetramer
Mol. Mass.:68422.27
Organism:Homo sapiens (Human)
Description:P06276
Residue:602
BDBM50246977
NameBDBM50246977
Synonyms:CHEMBL4077192
TypeSmall organic molecule
Emp. Form.C26H28N2O
Mol. Mass.384.5133
SMILESO=C(NCC1CCCN(C1)C1Cc2ccccc2C1)c1cccc2ccccc12