Reaction Details
TargetAcetyl-CoA carboxylase 1
LigandBDBM50247110
Substrate/Competitorn/a
Meas. Tech.ChEMBL_1677380 (CHEMBL4027523)
IC50 26±n/a nM
Citation Mizojiri, RAsano, MTomita, DBanno, HNii, NSasaki, MSumi, HSatoh, YYamamoto, YMoriya, TSatomi, YMaezaki, H Discovery of Novel Selective Acetyl-CoA Carboxylase (ACC) 1 Inhibitors. J Med Chem61:1098-1117 (2018) 
 
Acetyl-CoA carboxylase 1
Name:Acetyl-CoA carboxylase 1
Type:Protein
Mol. Mass.:265543.22
Organism:Homo sapiens (Human)
Description:Q13085
Residue:2346
BDBM50247110
NameBDBM50247110
Synonyms:CHEMBL4083131
TypeSmall organic molecule
Emp. Form.C28H27NO3S
Mol. Mass.457.584
SMILESCC(NC(C)=O)c1ccc2sc(cc2c1)-c1ccc(Oc2cccc(OCC3CC3)c2)cc1